{"text_format":"1","workbook":"xlsx","n_sheets":14,"sheets":["Provider Information","Trial Balance","Trial Balance Reclassifications","Trial Balance Adjustments","Anticipated Costs","Indirect Cost Allocation","Allocation Descriptions","Daily Visits","Monthly Visits","Services Provided","Comments","CC PPS-1 Rate","CC PPS-2 Rate","Certification"],"not_rendered":{"charts":0,"images":0,"macros":1,"external_links":0,"defined_names":54,"comments":0,"pivot_tables":0},"unopened":[],"bounds":{"document_bytes":16777216,"sheet_cells":100000,"rows_first":2000,"rows_last":500,"rows_between":2000,"halvings":0,"cell_chars":16384,"cell_head_chars":4096},"cells_cut":0,"cells_raw":0,"read":"whole","date_system":"1900"}

{"sheet":"Provider Information","index":0,"n_rows":88,"n_cols":11,"rows_kept":88,"cut":false,"hidden":false,"merged":[[0,0,0,10],[15,5,15,6],[16,2,16,10],[15,2,15,3],[39,7,39,8],[7,0,7,2],[15,8,15,10],[14,8,14,10],[17,3,17,10],[13,2,13,10],[14,2,14,6],[25,1,25,9],[31,7,31,10],[20,6,20,10],[8,0,8,10],[33,7,33,8],[34,7,34,8],[35,7,35,8],[32,0,32,10],[4,6,4,10],[5,6,5,10],[7,3,7,10],[10,0,10,2],[10,3,10,10],[87,0,87,10],[2,3,2,10],[3,3,3,10],[3,0,3,2],[4,0,4,2],[5,0,5,2],[6,0,6,2],[6,3,6,10],[12,0,12,10],[55,0,55,10],[22,0,22,9],[18,3,18,10],[66,5,66,10],[54,0,54,10],[40,7,40,8],[43,7,43,8],[37,7,37,8],[29,0,29,5],[30,0,30,4],[57,0,57,1],[34,0,34,6],[83,7,83,8],[2,0,2,2],[18,0,18,2],[19,0,19,5],[20,0,20,5],[21,0,21,10],[51,0,51,8],[44,7,44,8],[41,0,41,10],[33,0,33,6],[42,0,42,6],[30,5,30,10],[28,0,28,10],[23,1,23,9],[24,1,24,9],[26,1,26,9],[27,1,27,9],[29,6,29,10],[85,0,85,6],[43,0,43,6],[44,0,44,6],[45,0,45,6],[46,0,46,6],[47,0,47,6],[48,0,48,6],[49,0,49,6],[70,0,70,6],[71,0,71,6],[72,0,72,6],[73,0,73,6],[74,0,74,6],[75,0,75,6],[76,0,76,6],[78,0,78,6],[61,3,61,10],[85,7,85,8],[79,7,79,8],[80,7,80,8],[58,8,58,10],[69,0,69,6],[79,0,79,6],[81,0,81,6],[83,0,83,6],[84,0,84,6],[77,0,77,10],[31,0,31,6],[66,0,66,4],[65,0,65,5],[64,0,64,5],[63,0,63,5],[61,0,61,2],[60,0,60,1],[62,0,62,2],[64,6,64,10],[80,0,80,6],[76,7,76,8],[67,7,67,10],[75,7,75,8],[74,7,74,8],[73,7,73,8],[84,7,84,8],[50,7,50,10],[50,1,50,6],[65,6,65,10],[82,0,82,6],[81,7,81,8],[13,0,13,1],[82,7,82,8],[78,7,78,8],[58,0,58,1],[59,0,59,1],[39,0,39,6],[36,0,36,6],[35,0,35,6],[40,0,40,6],[37,0,37,6],[38,0,38,6],[57,2,57,10],[58,2,58,6],[46,7,46,8],[36,7,36,8],[38,7,38,8],[42,7,42,8],[45,7,45,8],[19,6,19,10],[63,6,63,10],[14,0,14,1],[15,0,15,1],[16,0,16,1],[17,0,17,2],[86,0,86,10],[11,0,11,10],[1,0,1,10],[53,0,53,10],[72,7,72,8],[71,7,71,8],[70,7,70,8],[69,7,69,8],[68,0,68,10],[67,0,67,6],[51,9,51,10],[47,7,47,8],[48,7,48,8],[49,7,49,8],[56,0,56,9],[62,3,62,10],[60,2,60,10],[59,8,59,10],[59,2,59,3],[59,5,59,6],[52,0,52,5],[52,6,52,10],[9,7,9,10],[9,0,9,3]]}
["CCBHC Cost Report"]
["This top section is for Medicaid ID, NPI, reporting period, and rate period, and will be automatically populated in all other tabs. Use tab to move to input areas. Use the arrow keys to read through the document."]
["MEDICAID ID:"]
["NPI:"]
["REPORTING PERIOD:",null,null,"From:",null,"To:"]
["RATE PERIOD:",null,null,"From:",null,"To:"]
["WORKSHEET:",null,null,"Provider Information"]
["PPS METHODOLOGY:"]
{"$rows_left_out":81}
{"sheet":"Trial Balance","index":1,"n_rows":103,"n_cols":12,"rows_kept":103,"cut":false,"hidden":false,"merged":[[64,0,64,2],[73,0,73,2],[74,0,74,2],[75,0,75,2],[54,0,54,11],[63,0,63,2],[65,0,65,2],[48,0,48,11],[49,1,49,2],[50,0,50,11],[67,1,67,2],[70,0,70,11],[69,0,69,2],[62,0,62,2],[58,0,58,2],[59,0,59,2],[60,0,60,2],[61,0,61,2],[77,0,77,2],[72,0,72,2],[80,0,80,11],[97,1,97,2],[66,0,66,11],[96,0,96,11],[68,0,68,11],[90,0,90,11],[76,0,76,2],[100,0,100,2],[99,0,99,2],[78,0,78,2],[79,0,79,2],[83,0,83,2],[84,0,84,2],[85,0,85,11],[87,0,87,11],[93,0,93,11],[82,0,82,11],[81,1,81,2],[91,1,91,2],[92,0,92,11],[98,0,98,11],[95,0,95,2],[88,0,88,11],[18,0,18,2],[19,0,19,2],[10,0,10,11],[0,0,0,11],[8,0,8,11],[2,2,2,11],[3,2,3,11],[6,2,6,11],[4,5,4,11],[5,5,5,11],[1,0,1,11],[7,0,7,11],[102,0,102,11],[11,0,11,2],[94,0,94,11],[33,0,33,11],[41,0,41,11],[57,0,57,2],[56,0,56,11],[71,0,71,11],[89,0,89,2],[51,0,51,2],[52,0,52,2],[39,0,39,2],[86,0,86,11],[23,0,23,2],[43,0,43,2],[20,0,20,2],[21,0,21,2],[25,0,25,2],[24,0,24,2],[22,0,22,2],[34,0,34,2],[42,0,42,2],[26,0,26,2],[27,0,27,2],[101,0,101,11],[29,1,29,2],[28,0,28,11],[36,0,36,11],[37,1,37,2],[38,0,38,11],[9,0,9,11],[40,0,40,11],[53,0,53,11],[55,0,55,11],[44,0,44,2],[45,0,45,2],[46,0,46,2],[47,0,47,2],[31,0,31,2],[32,0,32,11],[30,0,30,11],[35,0,35,2],[12,0,12,2],[13,0,13,2],[14,0,14,2],[15,0,15,2],[16,0,16,2],[17,0,17,2]]}
["CCBHC Cost Report"]
["This is the top section.  It is the Medicaid ID, NPI, reporting period, and rate period, automatically inserted from the provider information tab.  Use tab to move to input areas. Use the arrow keys to read through the document."]
["MEDICAID ID:",null,{"$f":"IF('Provider Information'!$D$3=\"\",\"\",'Provider Information'!$D$3)","v":""}]
["NPI:",null,{"$f":"IF('Provider Information'!$D$4=\"\",\"\",'Provider Information'!$D$4)","v":""}]
["REPORTING PERIOD:",null,"From:",{"$f":"IF('Provider Information'!E5=\"\",\"\",'Provider Information'!$E$5)","v":""},"To:",{"$f":"IF('Provider Information'!$G$5=\"\",\"\",'Provider Information'!$G$5)","v":""}]
["RATE PERIOD:",null,"From:",{"$f":"IF('Provider Information'!$E$6=\"\",\"\",'Provider Information'!$E$6)","v":""},"To:",{"$f":"IF('Provider Information'!$G$6=\"\",\"\",'Provider Information'!$G$6)","v":""}]
["WORKSHEET:",null,"Trial Balance"]
["Part 1 is for entering direct costs for CCBHC services.  Use tab to move to input areas. Use the arrow keys to read through the document."]
{"$rows_left_out":96}
{"sheet":"Trial Balance Reclassifications","index":2,"n_rows":49,"n_cols":10,"rows_kept":49,"cut":false,"hidden":false,"merged":[[44,0,44,9],[43,1,43,3],[45,0,45,3],[26,1,26,3],[33,1,33,3],[42,1,42,3],[41,1,41,3],[40,1,40,3],[39,1,39,3],[38,1,38,3],[27,1,27,3],[32,1,32,3],[31,1,31,3],[30,1,30,3],[29,1,29,3],[28,1,28,3],[48,0,48,9],[2,0,2,1],[46,0,46,9],[11,1,11,3],[12,1,12,3],[13,1,13,3],[14,1,14,3],[15,1,15,3],[9,1,9,3],[10,1,10,3],[8,0,8,3],[16,1,16,3],[17,1,17,3],[7,0,7,9],[18,1,18,3],[19,1,19,3],[2,2,2,9],[3,2,3,9],[4,5,4,9],[5,5,5,9],[0,0,0,9],[1,0,1,9],[47,0,47,9],[20,1,20,3],[3,0,3,1],[4,0,4,1],[5,0,5,1],[6,0,6,1],[6,2,6,9],[37,1,37,3],[21,1,21,3],[22,1,22,3],[23,1,23,3],[24,1,24,3],[25,1,25,3],[36,1,36,3],[35,1,35,3],[34,1,34,3]]}
["CCBHC Cost Report"]
["This is the top section.  It is the Medicaid ID, NPI, reporting period, and rate period, automatically inserted from the provider information tab.  Use tab to move to input areas. Use the arrow keys to read through the document."]
["MEDICAID ID:",null,{"$f":"IF('Provider Information'!$D$3=\"\",\"\",'Provider Information'!$D$3)","v":""}]
["NPI:",null,{"$f":"IF('Provider Information'!$D$4=\"\",\"\",'Provider Information'!$D$4)","v":""}]
["REPORTING PERIOD:",null,"From:",{"$f":"IF('Provider Information'!E5=\"\",\"\",'Provider Information'!$E$5)","v":""},"To:",{"$f":"IF('Provider Information'!$G$5=\"\",\"\",'Provider Information'!$G$5)","v":""}]
["RATE PERIOD:",null,"From:",{"$f":"IF('Provider Information'!$E$6=\"\",\"\",'Provider Information'!$E$6)","v":""},"To:",{"$f":"IF('Provider Information'!$G$6=\"\",\"\",'Provider Information'!$G$6)","v":""}]
["WORKSHEET:",null,"Trial Balance Reclassifications"]
["The bottom section is for entering detail to support the reclassification of expenses.  Use tab to move to input areas. Use the arrow keys to read through the document."]
{"$rows_left_out":42}
{"sheet":"Trial Balance Adjustments","index":3,"n_rows":46,"n_cols":8,"rows_kept":46,"cut":false,"hidden":false,"merged":[[0,0,0,7],[9,0,9,3],[10,0,10,3],[2,2,2,7],[3,2,3,7],[4,5,4,7],[5,5,5,7],[6,2,6,7],[3,0,3,1],[4,0,4,1],[2,0,2,1],[5,0,5,1],[6,0,6,1],[8,0,8,7],[11,0,11,3],[21,1,21,3],[1,0,1,7],[7,0,7,7],[45,0,45,7],[41,0,41,7],[26,0,26,3],[15,0,15,3],[40,0,40,3],[29,0,29,3],[24,0,24,7],[42,0,42,7],[38,0,38,7],[36,0,36,7],[37,1,37,3],[43,0,43,7],[12,0,12,3],[16,0,16,3],[17,0,17,3],[35,0,35,3],[34,0,34,3],[33,0,33,3],[32,0,32,3],[31,0,31,3],[30,0,30,3],[27,0,27,3],[28,0,28,3],[14,0,14,3],[20,0,20,7],[22,0,22,7],[25,0,25,7],[44,0,44,7],[23,0,23,3],[13,0,13,3],[18,0,18,3],[19,0,19,3],[39,0,39,3]]}
["CCBHC Cost Report"]
["This is the top section.  It is the Medicaid ID, NPI, reporting period, and rate period, automatically inserted from the provider information tab.  Use tab to move to input areas. Use the arrow keys to read through the document."]
["MEDICAID ID:",null,{"$f":"IF('Provider Information'!$D$3=\"\",\"\",'Provider Information'!$D$3)","v":""}]
["NPI:",null,{"$f":"IF('Provider Information'!$D$4=\"\",\"\",'Provider Information'!$D$4)","v":""}]
["REPORTING PERIOD:",null,"From:",{"$f":"IF('Provider Information'!E5=\"\",\"\",'Provider Information'!$E$5)","v":""},"To:",{"$f":"IF('Provider Information'!$G$5=\"\",\"\",'Provider Information'!$G$5)","v":""}]
["RATE PERIOD:",null,"From:",{"$f":"IF('Provider Information'!$E$6=\"\",\"\",'Provider Information'!$E$6)","v":""},"To:",{"$f":"IF('Provider Information'!$G$6=\"\",\"\",'Provider Information'!$G$6)","v":""}]
["WORKSHEET:",null,"Trial Balance Adjustments"]
["Part 1 is for entering common adjustments.  Use tab to move to input areas. Use the arrow keys to read through the document."]
{"$rows_left_out":39}
{"sheet":"Anticipated Costs","index":4,"n_rows":104,"n_cols":7,"rows_kept":104,"cut":false,"hidden":false,"merged":[[66,0,66,6],[49,1,49,2],[67,1,67,2],[82,0,82,6],[80,0,80,6],[81,1,81,2],[38,0,38,6],[36,0,36,6],[37,1,37,2],[50,0,50,6],[48,0,48,6],[69,0,69,2],[73,0,73,2],[74,0,74,2],[71,0,71,6],[72,0,72,2],[62,0,62,2],[63,0,63,2],[64,0,64,2],[65,0,65,2],[45,0,45,2],[58,0,58,2],[59,0,59,2],[93,0,93,6],[92,0,92,6],[90,0,90,6],[91,1,91,2],[98,0,98,6],[96,0,96,6],[99,0,99,2],[97,1,97,2],[68,0,68,6],[13,0,13,2],[14,0,14,2],[15,0,15,2],[16,0,16,2],[1,0,1,6],[7,0,7,6],[9,0,9,6],[60,0,60,2],[61,0,61,2],[52,0,52,2],[51,0,51,2],[39,0,39,2],[17,0,17,2],[18,0,18,2],[19,0,19,2],[20,0,20,2],[21,0,21,2],[25,0,25,2],[26,0,26,2],[27,0,27,2],[31,0,31,2],[30,0,30,6],[29,1,29,2],[28,0,28,6],[0,0,0,6],[8,0,8,6],[11,0,11,2],[10,0,10,6],[22,0,22,2],[23,0,23,2],[24,0,24,2],[12,0,12,2],[103,0,103,6],[101,0,101,6],[88,0,88,6],[95,0,95,2],[70,0,70,6],[57,0,57,2],[56,0,56,6],[41,0,41,6],[34,0,34,2],[42,0,42,2],[35,0,35,2],[46,0,46,2],[47,0,47,2],[54,0,54,6],[43,0,43,2],[44,0,44,2],[102,0,102,6],[86,0,86,6],[33,0,33,6],[6,2,6,6],[2,2,2,6],[3,2,3,6],[4,5,4,6],[5,5,5,6],[75,0,75,2],[76,0,76,2],[77,0,77,2],[78,0,78,2],[32,0,32,6],[40,0,40,6],[53,0,53,6],[55,0,55,6],[100,0,100,2],[79,0,79,2],[83,0,83,2],[84,0,84,2],[89,0,89,2],[94,0,94,6],[85,0,85,6],[87,0,87,6]]}
["CCBHC Cost Report"]
["This is the top section.  It is the Medicaid ID, NPI, reporting period, and rate period, automatically inserted from the provider information tab.  Use tab to move to input areas. Use the arrow keys to read through the document."]
["MEDICAID ID:",null,{"$f":"IF('Provider Information'!$D$3=\"\",\"\",'Provider Information'!$D$3)","v":""}]
["NPI:",null,{"$f":"IF('Provider Information'!$D$4=\"\",\"\",'Provider Information'!$D$4)","v":""}]
["REPORTING PERIOD:",null,"From:",{"$f":"IF('Provider Information'!E5=\"\",\"\",'Provider Information'!$E$5)","v":""},"To:",{"$f":"IF('Provider Information'!$G$5=\"\",\"\",'Provider Information'!$G$5)","v":""}]
["RATE PERIOD:",null,"From:",{"$f":"IF('Provider Information'!$E$6=\"\",\"\",'Provider Information'!$E$6)","v":""},"To:",{"$f":"IF('Provider Information'!$G$6=\"\",\"\",'Provider Information'!$G$6)","v":""}]
["WORKSHEET:",null,"Anticipated Costs"]
["Part 1 is for entering direct CCBHC expenses.  Use tab to move to input areas. Use the arrow keys to read through the document."]
{"$rows_left_out":97}
{"sheet":"Indirect Cost Allocation","index":5,"n_rows":27,"n_cols":8,"rows_kept":27,"cut":false,"hidden":false,"merged":[[5,0,5,1],[6,2,6,7],[6,0,6,1],[12,0,12,6],[13,0,13,6],[5,5,5,7],[7,0,7,7],[8,0,8,6],[9,0,9,6],[11,0,11,4],[2,2,2,7],[3,2,3,7],[4,5,4,7],[0,0,0,7],[2,0,2,1],[3,0,3,1],[1,0,1,7],[4,0,4,1],[14,0,14,6],[15,0,15,6],[25,0,25,7],[26,0,26,7],[10,0,10,3],[10,4,10,7],[11,5,11,7],[16,0,16,6],[17,0,17,6],[18,0,18,6],[19,0,19,6],[20,0,20,6],[21,0,21,6],[23,0,23,6],[24,0,24,6],[22,0,22,6]]}
["CCBHC Cost Report"]
["This is the top section.  It is the Medicaid ID, NPI, reporting period, and rate period, automatically inserted from the provider information tab.  Use tab to move to input areas. Use the arrow keys to read through the document."]
["MEDICAID ID:",null,{"$f":"IF('Provider Information'!$D$3=\"\",\"\",'Provider Information'!$D$3)","v":""}]
["NPI:",null,{"$f":"IF('Provider Information'!$D$4=\"\",\"\",'Provider Information'!$D$4)","v":""}]
["REPORTING PERIOD:",null,"From:",{"$f":"IF('Provider Information'!E5=\"\",\"\",'Provider Information'!$E$5)","v":""},"To:",{"$f":"IF('Provider Information'!$G$5=\"\",\"\",'Provider Information'!$G$5)","v":""}]
["RATE PERIOD:",null,"From:",{"$f":"IF('Provider Information'!$E$6=\"\",\"\",'Provider Information'!$E$6)","v":""},"To:",{"$f":"IF('Provider Information'!$G$6=\"\",\"\",'Provider Information'!$G$6)","v":""}]
["WORKSHEET:",null,"Indirect Cost Allocation"]
["The bottom section is used for identifying the method for allocating indirect costs.  Use tab to move to input areas. Use the arrow keys to read through the document."]
{"$rows_left_out":20}
{"sheet":"Allocation Descriptions","index":6,"n_rows":41,"n_cols":5,"rows_kept":41,"cut":false,"hidden":false,"merged":[[40,0,40,8],[10,0,38,8],[9,0,9,8],[0,0,0,8],[8,0,8,8],[2,1,2,8],[3,1,3,8],[4,4,4,8],[5,4,5,8],[6,1,6,8],[1,0,1,8],[7,0,7,8],[39,0,39,8]]}
["CCBHC Cost Report"]
["This is the top section.  It is the Medicaid ID, NPI, reporting period, and rate period, automatically inserted from the provider information tab.  Use tab to move to input areas. Use the arrow keys to read through the document."]
["MEDICAID ID:",{"$f":"IF('Provider Information'!$D$3=\"\",\"\",'Provider Information'!$D$3)","v":""}]
["NPI:",{"$f":"IF('Provider Information'!$D$4=\"\",\"\",'Provider Information'!$D$4)","v":""}]
["REPORTING PERIOD:","From:",{"$f":"IF('Provider Information'!E5=\"\",\"\",'Provider Information'!$E$5)","v":""},"To:",{"$f":"IF('Provider Information'!$G$5=\"\",\"\",'Provider Information'!$G$5)","v":""}]
["RATE PERIOD:","From:",{"$f":"IF('Provider Information'!$E$6=\"\",\"\",'Provider Information'!$E$6)","v":""},"To:",{"$f":"IF('Provider Information'!$G$6=\"\",\"\",'Provider Information'!$G$6)","v":""}]
["WORKSHEET:","Allocation Descriptions"]
["The bottom section is used for entering the description of allocations.  The descriptions should include the tab in which the allocation is referenced, the method for allocation and the amounts allocated.  Use tab to move to input areas. Use the arrow keys to read through the document."]
{"$rows_left_out":34}
{"sheet":"Daily Visits","index":7,"n_rows":16,"n_cols":8,"rows_kept":16,"cut":false,"hidden":false,"merged":[[4,0,4,1],[4,5,4,7],[5,0,5,1],[5,5,5,7],[6,0,6,1],[6,2,6,7],[0,0,0,7],[2,2,2,7],[2,0,2,1],[3,0,3,1],[3,2,3,7],[1,0,1,7],[7,0,7,7],[8,0,8,7],[15,0,15,7],[9,0,9,6],[10,0,10,6],[11,0,11,6],[13,0,13,6],[12,0,12,6],[14,0,14,7]]}
["CCBHC Cost Report"]
["This is the top section.  It is the Medicaid ID, NPI, reporting period, and rate period, automatically inserted from the provider information tab.  Use tab to move to input areas. Use the arrow keys to read through the document."]
["MEDICAID ID:",null,{"$f":"IF('Provider Information'!$D$3=\"\",\"\",'Provider Information'!$D$3)","v":""}]
["NPI:",null,{"$f":"IF('Provider Information'!$D$4=\"\",\"\",'Provider Information'!$D$4)","v":""}]
["REPORTING PERIOD:",null,"From:",{"$f":"IF('Provider Information'!E5=\"\",\"\",'Provider Information'!$E$5)","v":""},"To:",{"$f":"IF('Provider Information'!$G$5=\"\",\"\",'Provider Information'!$G$5)","v":""}]
["RATE PERIOD:",null,"From:",{"$f":"IF('Provider Information'!$E$6=\"\",\"\",'Provider Information'!$E$6)","v":""},"To:",{"$f":"IF('Provider Information'!$G$6=\"\",\"\",'Provider Information'!$G$6)","v":""}]
["WORKSHEET:",null,"Daily Visits"]
["The bottom section is used for identifying the number of days patients received CCBHC services.  Use tab to move to input areas. Use the arrow keys to read through the document."]
{"$rows_left_out":9}
{"sheet":"Monthly Visits","index":8,"n_rows":18,"n_cols":10,"rows_kept":18,"cut":false,"hidden":false,"merged":[[17,0,17,9],[8,0,8,9],[10,0,10,1],[11,0,11,1],[12,0,12,1],[13,0,13,1],[15,0,15,1],[14,0,14,1],[10,8,15,8],[16,0,16,9],[0,0,0,9],[9,0,9,9],[2,1,2,9],[3,1,3,9],[5,4,5,9],[4,4,4,9],[6,1,6,9],[1,0,1,9],[7,0,7,9]]}
["CCBHC Cost Report"]
["This is the top section.  It is the Medicaid ID, NPI, reporting period, and rate period, automatically inserted from the provider information tab.  Use tab to move to input areas. Use the arrow keys to read through the document."]
["MEDICAID ID:",{"$f":"IF('Provider Information'!$D$3=\"\",\"\",'Provider Information'!$D$3)","v":""}]
["NPI:",{"$f":"IF('Provider Information'!$D$4=\"\",\"\",'Provider Information'!$D$4)","v":""}]
["REPORTING PERIOD:","From:",{"$f":"IF('Provider Information'!E5=\"\",\"\",'Provider Information'!$E$5)","v":""},"To:",{"$f":"IF('Provider Information'!$G$5=\"\",\"\",'Provider Information'!$G$5)","v":""}]
["RATE PERIOD:","From:",{"$f":"IF('Provider Information'!$E$6=\"\",\"\",'Provider Information'!$E$6)","v":""},"To:",{"$f":"IF('Provider Information'!$G$6=\"\",\"\",'Provider Information'!$G$6)","v":""}]
["WORKSHEET:","Monthly Visits"]
["The bottom section is used for identifying the number of months each patient received CCBHC services.  Use tab to move to input areas. Use the arrow keys to read through the document."]
{"$rows_left_out":11}
{"sheet":"Services Provided","index":9,"n_rows":78,"n_cols":9,"rows_kept":78,"cut":false,"hidden":false,"merged":[[77,0,77,4],[42,0,42,4],[44,0,44,4],[45,0,45,2],[62,0,62,2],[61,0,61,2],[73,0,73,4],[64,1,64,2],[72,1,72,2],[50,0,50,2],[55,0,55,2],[56,0,56,2],[46,0,46,2],[70,0,70,2],[68,0,68,4],[74,0,74,2],[75,0,75,2],[69,0,69,2],[19,0,19,2],[20,0,20,2],[21,0,21,2],[60,0,60,2],[26,0,26,2],[34,0,34,2],[53,0,53,2],[27,0,27,2],[57,0,57,2],[58,0,58,2],[47,0,47,2],[24,0,24,2],[25,0,25,2],[35,0,35,2],[13,0,13,2],[16,0,16,2],[48,0,48,2],[49,0,49,2],[41,0,41,4],[43,0,43,4],[17,0,17,2],[18,0,18,2],[36,0,36,6],[28,0,28,6],[22,0,22,2],[23,0,23,2],[33,0,33,6],[14,0,14,2],[54,0,54,2],[63,0,63,4],[0,0,0,6],[8,0,8,6],[11,0,11,2],[10,0,10,6],[2,2,2,6],[3,2,3,6],[4,5,4,6],[5,5,5,6],[1,0,1,6],[7,0,7,6],[9,0,9,6],[6,2,6,6],[59,0,59,2],[12,0,12,2],[76,0,76,4],[51,0,51,2],[15,0,15,2],[71,0,71,4],[65,0,65,4],[30,0,30,6],[67,0,67,4],[29,1,29,2],[38,0,38,6],[37,1,37,2],[66,0,66,2],[32,0,32,6],[31,0,31,2],[52,0,52,2],[39,0,39,2],[40,0,40,2]]}
["CCBHC Cost Report"]
["This is the top section.  It is the Medicaid ID, NPI, reporting period, and rate period, automatically inserted from the provider information tab.  Use tab to move to input areas. Use the arrow keys to read through the document."]
["MEDICAID ID:",null,{"$f":"IF('Provider Information'!$D$3=\"\",\"\",'Provider Information'!$D$3)","v":""}]
["NPI:",null,{"$f":"IF('Provider Information'!$D$4=\"\",\"\",'Provider Information'!$D$4)","v":""}]
["REPORTING PERIOD:",null,"From:",{"$f":"IF('Provider Information'!E5=\"\",\"\",'Provider Information'!$E$5)","v":""},"To:",{"$f":"IF('Provider Information'!$G$5=\"\",\"\",'Provider Information'!$G$5)","v":""}]
["RATE PERIOD:",null,"From:",{"$f":"IF('Provider Information'!$E$6=\"\",\"\",'Provider Information'!$E$6)","v":""},"To:",{"$f":"IF('Provider Information'!$G$6=\"\",\"\",'Provider Information'!$G$6)","v":""}]
["WORKSHEET:",null,"Services Provided"]
["Part 1 is for single site or consolidated information for services provided.  Use tab to move to input areas. Use the arrow keys to read through the document."]
{"$rows_left_out":71}
{"sheet":"Comments","index":10,"n_rows":273,"n_cols":11,"rows_kept":273,"cut":false,"hidden":false,"merged":[[0,0,0,10],[5,0,5,1],[1,0,1,10],[7,0,7,10],[2,0,2,1],[2,2,2,10],[3,0,3,1],[3,2,3,10],[4,0,4,1],[4,5,4,10],[271,0,271,10],[272,0,272,10],[8,0,8,10],[5,5,5,10],[6,0,6,1],[6,2,6,10]]}
["CCBHC Cost Report"]
["This is the top section.  It is the Medicaid ID, NPI, reporting period, and rate period, automatically inserted from the provider information tab.  Use tab to move to input areas. Use the arrow keys to read through the document."]
["MEDICAID ID:",null,{"$f":"IF('Provider Information'!$D$3=\"\",\"\",'Provider Information'!$D$3)","v":""}]
["NPI:",null,{"$f":"IF('Provider Information'!$D$4=\"\",\"\",'Provider Information'!$D$4)","v":""}]
["REPORTING PERIOD:",null,"From:",{"$f":"IF('Provider Information'!E5=\"\",\"\",'Provider Information'!$E$5)","v":""},"To:",{"$f":"IF('Provider Information'!$G$5=\"\",\"\",'Provider Information'!$G$5)","v":""}]
["RATE PERIOD:",null,"From:",{"$f":"IF('Provider Information'!$E$6=\"\",\"\",'Provider Information'!$E$6)","v":""},"To:",{"$f":"IF('Provider Information'!$G$6=\"\",\"\",'Provider Information'!$G$6)","v":""}]
["WORKSHEET:",null,"Comments"]
["The bottom section is used to identify the worksheet, line and comments.  Use tab to move to input areas. Use the arrow keys to read through the document."]
{"$rows_left_out":266}
{"sheet":"CC PPS-1 Rate","index":11,"n_rows":24,"n_cols":6,"rows_kept":24,"cut":false,"hidden":false,"merged":[[23,0,23,5],[9,0,9,4],[15,0,15,4],[8,0,8,5],[0,0,0,5],[21,0,21,5],[14,0,14,5],[19,0,19,4],[18,0,18,4],[17,0,17,4],[16,0,16,4],[12,0,12,4],[11,0,11,4],[20,0,20,4],[10,0,10,4],[22,0,22,5],[7,0,7,5],[13,0,13,5],[1,0,1,5],[2,1,2,5],[3,1,3,5],[6,1,6,5],[4,4,4,5],[5,4,5,5]]}
["CCBHC Cost Report"]
["This is the top section.  It is the Medicaid ID, NPI, reporting period, and rate period, automatically inserted from the provider information tab.  Use tab to move to input areas. Use the arrow keys to read through the document."]
["MEDICAID ID:",{"$f":"IF('Provider Information'!$D$3=\"\",\"\",'Provider Information'!$D$3)","v":""}]
["NPI:",{"$f":"IF('Provider Information'!$D$4=\"\",\"\",'Provider Information'!$D$4)","v":""}]
["REPORTING PERIOD:","From:",{"$f":"IF('Provider Information'!E5=\"\",\"\",'Provider Information'!$E$5)","v":""},"To:",{"$f":"IF('Provider Information'!$G$5=\"\",\"\",'Provider Information'!$G$5)","v":""}]
["RATE PERIOD:","From:",{"$f":"IF('Provider Information'!$E$6=\"\",\"\",'Provider Information'!$E$6)","v":""},"To:",{"$f":"IF('Provider Information'!$G$6=\"\",\"\",'Provider Information'!$G$6)","v":""}]
["WORKSHEET:","CC PPS-1 Rate"]
["Part 1 is automatically populated with the direct and indirect costs for CCBHC services.  Use tab to move to input areas. Use the arrow keys to read through the document."]
{"$rows_left_out":17}
{"sheet":"CC PPS-2 Rate","index":12,"n_rows":31,"n_cols":10,"rows_kept":31,"cut":false,"hidden":false,"merged":[[18,0,18,7],[17,0,17,1],[10,0,10,1],[13,0,13,1],[15,0,15,1],[16,0,16,1],[14,0,14,1],[11,0,11,1],[12,0,12,1],[22,0,22,1],[23,0,23,1],[24,0,24,1],[19,0,19,9],[30,0,30,9],[28,0,28,9],[21,0,21,1],[20,0,20,9],[25,0,25,1],[26,0,26,1],[27,0,27,1],[21,8,27,8],[29,0,29,9],[1,0,1,9],[7,0,7,9],[0,0,0,9],[8,0,8,9],[9,8,17,8],[9,0,9,1],[2,1,2,9],[3,1,3,9],[4,4,4,9],[5,4,5,9],[6,1,6,9]]}
["CCBHC Cost Report"]
["This is the top section.  It is the Medicaid ID, NPI, reporting period, and rate period, automatically inserted from the provider information tab.  Use tab to move to input areas. Use the arrow keys to read through the document."]
["MEDICAID ID:",{"$f":"IF('Provider Information'!$D$3=\"\",\"\",'Provider Information'!$D$3)","v":""}]
["NPI:",{"$f":"IF('Provider Information'!$D$4=\"\",\"\",'Provider Information'!$D$4)","v":""}]
["REPORTING PERIOD:","From:",{"$f":"IF('Provider Information'!E5=\"\",\"\",'Provider Information'!$E$5)","v":""},"To:",{"$f":"IF('Provider Information'!$G$5=\"\",\"\",'Provider Information'!$G$5)","v":""}]
["RATE PERIOD:","From:",{"$f":"IF('Provider Information'!$E$6=\"\",\"\",'Provider Information'!$E$6)","v":""},"To:",{"$f":"IF('Provider Information'!$G$6=\"\",\"\",'Provider Information'!$G$6)","v":""}]
["WORKSHEET:","CC PPS-2 Rate"]
["Part 1 is used to determine the cost-to-charge ratio allocation by population group. Use tab to move to input areas. Use the arrow keys to read through the document."]
{"$rows_left_out":24}
{"sheet":"Certification","index":13,"n_rows":21,"n_cols":6,"rows_kept":21,"cut":false,"hidden":false,"merged":[[0,0,0,11],[2,0,2,1],[3,0,3,1],[4,0,4,1],[5,0,5,1],[2,2,2,11],[3,2,3,11],[4,5,4,11],[5,5,5,11],[1,0,1,11],[13,3,13,11],[14,0,14,2],[14,3,14,11],[8,0,8,11],[9,0,9,11],[10,0,10,11],[11,0,11,11],[6,0,6,1],[6,2,6,11],[20,0,20,11],[15,0,15,2],[15,3,15,11],[16,0,16,2],[16,3,16,11],[17,0,17,2],[17,3,17,11],[19,0,19,11],[7,0,7,11],[18,0,18,2],[18,3,18,11],[12,0,12,2],[12,3,12,11],[13,0,13,2]]}
["CCBHC Cost Report"]
["This is the top section.  It is the Medicaid ID, NPI, reporting period, and rate period, automatically inserted from the provider information tab.  Use tab to move to input areas. Use the arrow keys to read through the document."]
["MEDICAID ID:",null,{"$f":"IF('Provider Information'!$D$3=\"\",\"\",'Provider Information'!$D$3)","v":""}]
["NPI:",null,{"$f":"IF('Provider Information'!$D$4=\"\",\"\",'Provider Information'!$D$4)","v":""}]
["REPORTING PERIOD:",null,"From:",{"$f":"IF('Provider Information'!$E$5=\"\",\"\",'Provider Information'!$E$5)","v":""},"To:",{"$f":"IF('Provider Information'!$G$5=\"\",\"\",'Provider Information'!$G$5)","v":""}]
["RATE PERIOD:",null,"From:",{"$f":"IF('Provider Information'!$E$6=\"\",\"\",'Provider Information'!$E$6)","v":""},"To:",{"$f":"IF('Provider Information'!$G$6=\"\",\"\",'Provider Information'!$G$6)","v":""}]
["WORKSHEET:",null,"Certification"]
["The bottom section is used to certify the completeness and accuracy of the data in this workbook.  Use tab to move to input areas. Use the arrow keys to read through the document."]
{"$rows_left_out":13}